Reaction Details
TargetKappa-type opioid receptor
LigandBDBM50181380
Substrate/Competitorn/a
Meas. Tech.ChEMBL_331364 (CHEMBL867089)
IC50 3700±n/a nM
Citation Goto, YArai-Otsuki, STachibana, YIchikawa, DOzaki, STakahashi, HIwasawa, YOkamoto, OOkuda, SOhta, HSagara, T Identification of a novel spiropiperidine opioid receptor-like 1 antagonist class by a focused library approach featuring 3D-pharmacophore similarity. J Med Chem49:847-9 (2006) 
 
Kappa-type opioid receptor
Name:Kappa-type opioid receptor
Type:G Protein-Coupled Receptor (GPCR)
Mol. Mass.:42648.76
Organism:Homo sapiens (Human)
Description:P41145
Residue:380
BDBM50181380
NameBDBM50181380
Synonyms:CHEMBL413571 | N-[3-spiro(2,3-dihydro-1H-indene-1,4'-piperidine)ylpropyl]-1,1'-biphenyl-2-carboxyamide
TypeSmall organic molecule
Emp. Form.C29H32N2O
Mol. Mass.424.5772
SMILESO=C(NCCCN1CCC2(CCc3ccccc23)CC1)c1ccccc1-c1ccccc1