Reaction Details
TargetNociceptin receptor
LigandBDBM50181399
Substrate/Competitorn/a
Meas. Tech.ChEMBL_331362 (CHEMBL867087)
IC50>1000±n/a nM
Citation Goto, YArai-Otsuki, STachibana, YIchikawa, DOzaki, STakahashi, HIwasawa, YOkamoto, OOkuda, SOhta, HSagara, T Identification of a novel spiropiperidine opioid receptor-like 1 antagonist class by a focused library approach featuring 3D-pharmacophore similarity. J Med Chem49:847-9 (2006) 
 
Nociceptin receptor
Name:Nociceptin receptor
Type:G Protein-Coupled Receptor (GPCR)
Mol. Mass.:40702.87
Organism:Homo sapiens (Human)
Description:P41146
Residue:370
BDBM50181399
NameBDBM50181399
Synonyms:CHEMBL427376 | N-(3-{2,3-dihydrospiro[indene-1,4'-piperidine]-1'-yl}propyl)-1-phenyl-2,3-dihydro-1H-indole-2-carboxamide
TypeSmall organic molecule
Emp. Form.C31H35N3O
Mol. Mass.465.6291
SMILESO=C(NCCCN1CCC2(CCc3ccccc23)CC1)C1Cc2ccccc2N1c1ccccc1