Reaction Details
TargetNociceptin receptor
LigandBDBM50181423
Substrate/Competitorn/a
Meas. Tech.ChEMBL_331362 (CHEMBL867087)
IC50>1000±n/a nM
Citation Goto, YArai-Otsuki, STachibana, YIchikawa, DOzaki, STakahashi, HIwasawa, YOkamoto, OOkuda, SOhta, HSagara, T Identification of a novel spiropiperidine opioid receptor-like 1 antagonist class by a focused library approach featuring 3D-pharmacophore similarity. J Med Chem49:847-9 (2006) 
 
Nociceptin receptor
Name:Nociceptin receptor
Type:G Protein-Coupled Receptor (GPCR)
Mol. Mass.:40702.87
Organism:Homo sapiens (Human)
Description:P41146
Residue:370
BDBM50181423
NameBDBM50181423
Synonyms:(2E)-N-(3-{2,3-dihydrospiro[indene-1,4'-piperidine]-1'-yl}propyl)-4-(4-methylphenyl)-4-oxobut-2-enamide | CHEMBL202401
TypeSmall organic molecule
Emp. Form.C27H32N2O2
Mol. Mass.416.5552
SMILESCc1ccc(cc1)C(=O)\C=C\C(=O)NCCCN1CCC2(CCc3ccccc23)CC1