Reaction Details
TargetRNA-directed RNA polymerase
LigandBDBM50181924
Substrate/Competitorn/a
Meas. Tech.ChEMBL_345618 (CHEMBL860683)
IC50 980±n/a nM
Citation Ishida, TSuzuki, THirashima, SMizutani, KYoshida, AAndo, IIkeda, SAdachi, THashimoto, H Benzimidazole inhibitors of hepatitis C virus NS5B polymerase: identification of 2-[(4-diarylmethoxy)phenyl]-benzimidazole. Bioorg Med Chem Lett16:1859-63 (2006) 
 
RNA-directed RNA polymerase
Name:RNA-directed RNA polymerase
Type:Protein
Mol. Mass.:25173.95
Organism:Hepatitis C virus
Description:Q8JXU8
Residue:229
BDBM50181924
NameBDBM50181924
Synonyms:1-cyclohexyl-2-(4-(2,2-diphenylethoxy)phenyl)-1H-benzo[d]imidazole-5-carboxylic acid | CHEMBL206624
TypeSmall organic molecule
Emp. Form.C34H32N2O3
Mol. Mass.516.6295
SMILESOC(=O)c1ccc2n(C3CCCCC3)c(nc2c1)-c1ccc(OCC(c2ccccc2)c2ccccc2)cc1