Reaction Details
TargetRNA-directed RNA polymerase
LigandBDBM50181929
Substrate/Competitorn/a
Meas. Tech.ChEMBL_345619 (CHEMBL860686)
IC50 3100±n/a nM
Citation Ishida, TSuzuki, THirashima, SMizutani, KYoshida, AAndo, IIkeda, SAdachi, THashimoto, H Benzimidazole inhibitors of hepatitis C virus NS5B polymerase: identification of 2-[(4-diarylmethoxy)phenyl]-benzimidazole. Bioorg Med Chem Lett16:1859-63 (2006) 
 
RNA-directed RNA polymerase
Name:RNA-directed RNA polymerase
Type:Protein
Mol. Mass.:25173.95
Organism:Hepatitis C virus
Description:Q8JXU8
Residue:229
BDBM50181929
NameBDBM50181929
Synonyms:1-cyclohexyl-2-(4-(dip-tolylmethoxy)phenyl)-1H-benzo[d]imidazole-5-carboxylic acid | CHEMBL203772
TypeSmall organic molecule
Emp. Form.C35H34N2O3
Mol. Mass.530.6561
SMILESCc1ccc(cc1)C(Oc1ccc(cc1)-c1nc2cc(ccc2n1C1CCCCC1)C(O)=O)c1ccc(C)cc1