Reaction Details
TargetRNA-directed RNA polymerase
LigandBDBM50181928
Substrate/Competitorn/a
Meas. Tech.ChEMBL_345618 (CHEMBL860683)
IC50 6700±n/a nM
Citation Ishida, TSuzuki, THirashima, SMizutani, KYoshida, AAndo, IIkeda, SAdachi, THashimoto, H Benzimidazole inhibitors of hepatitis C virus NS5B polymerase: identification of 2-[(4-diarylmethoxy)phenyl]-benzimidazole. Bioorg Med Chem Lett16:1859-63 (2006) 
 
RNA-directed RNA polymerase
Name:RNA-directed RNA polymerase
Type:Protein
Mol. Mass.:25173.95
Organism:Hepatitis C virus
Description:Q8JXU8
Residue:229
BDBM50181928
NameBDBM50181928
Synonyms:2-(4-(4-carboxybenzyloxy)phenyl)-1-cyclopentyl-1H-benzo[d]imidazole-5-carboxylic acid | CHEMBL206022
TypeSmall organic molecule
Emp. Form.C27H24N2O5
Mol. Mass.456.4899
SMILESOC(=O)c1ccc(COc2ccc(cc2)-c2nc3cc(ccc3n2C2CCCC2)C(O)=O)cc1