Reaction Details
TargetRNA-directed RNA polymerase
LigandBDBM50181938
Substrate/Competitorn/a
Meas. Tech.ChEMBL_345618 (CHEMBL860683)
IC50 270±n/a nM
Citation Ishida, TSuzuki, THirashima, SMizutani, KYoshida, AAndo, IIkeda, SAdachi, THashimoto, H Benzimidazole inhibitors of hepatitis C virus NS5B polymerase: identification of 2-[(4-diarylmethoxy)phenyl]-benzimidazole. Bioorg Med Chem Lett16:1859-63 (2006) 
 
RNA-directed RNA polymerase
Name:RNA-directed RNA polymerase
Type:Protein
Mol. Mass.:25173.95
Organism:Hepatitis C virus
Description:Q8JXU8
Residue:229
BDBM50181938
NameBDBM50181938
Synonyms:1-Cyclohexyl-2-[2-fluoro-4-(phenyl-pyridin-3-yl-methoxy)-phenyl]-1H-benzoimidazole-5-carboxylic acid | CHEMBL205716
TypeSmall organic molecule
Emp. Form.C32H28FN3O3
Mol. Mass.521.5814
SMILESOC(=O)c1ccc2n(C3CCCCC3)c(nc2c1)-c1ccc(OC(c2ccccc2)c2cccnc2)cc1F