Reaction Details
TargetRNA-directed RNA polymerase
LigandBDBM50181923
Substrate/Competitorn/a
Meas. Tech.ChEMBL_345619 (CHEMBL860686)
IC50 1300±n/a nM
Citation Ishida, TSuzuki, THirashima, SMizutani, KYoshida, AAndo, IIkeda, SAdachi, THashimoto, H Benzimidazole inhibitors of hepatitis C virus NS5B polymerase: identification of 2-[(4-diarylmethoxy)phenyl]-benzimidazole. Bioorg Med Chem Lett16:1859-63 (2006) 
 
RNA-directed RNA polymerase
Name:RNA-directed RNA polymerase
Type:Protein
Mol. Mass.:25173.95
Organism:Hepatitis C virus
Description:Q8JXU8
Residue:229
BDBM50181923
NameBDBM50181923
Synonyms:2-(4-(benzhydryloxy)phenyl)-1-cyclohexyl-1H-benzo[d]imidazole-5-carboxylic acid | CHEMBL206487
TypeSmall organic molecule
Emp. Form.C33H30N2O3
Mol. Mass.502.6029
SMILESOC(=O)c1ccc2n(C3CCCCC3)c(nc2c1)-c1ccc(OC(c2ccccc2)c2ccccc2)cc1