Reaction Details
TargetRNA-directed RNA polymerase
LigandBDBM50181926
Substrate/Competitorn/a
Meas. Tech.ChEMBL_345618 (CHEMBL860683)
IC50 640±n/a nM
Citation Ishida, TSuzuki, THirashima, SMizutani, KYoshida, AAndo, IIkeda, SAdachi, THashimoto, H Benzimidazole inhibitors of hepatitis C virus NS5B polymerase: identification of 2-[(4-diarylmethoxy)phenyl]-benzimidazole. Bioorg Med Chem Lett16:1859-63 (2006) 
 
RNA-directed RNA polymerase
Name:RNA-directed RNA polymerase
Type:Protein
Mol. Mass.:25173.95
Organism:Hepatitis C virus
Description:Q8JXU8
Residue:229
BDBM50181926
NameBDBM50181926
Synonyms:2-{4-[Bis-(4-dimethylcarbamoyl-phenyl)-methoxy]-2-fluoro-phenyl}-1-cyclohexyl-1H-benzoimidazole-5-carboxylic acid | CHEMBL203449
TypeSmall organic molecule
Emp. Form.C39H39FN4O5
Mol. Mass.662.7492
SMILESCN(C)C(=O)c1ccc(cc1)C(Oc1ccc(-c2nc3cc(ccc3n2C2CCCCC2)C(O)=O)c(F)c1)c1ccc(cc1)C(=O)N(C)C