Reaction Details
TargetRNA-directed RNA polymerase
LigandBDBM50181948
Substrate/Competitorn/a
Meas. Tech.ChEMBL_345618 (CHEMBL860683)
IC50 2300±n/a nM
Citation Ishida, TSuzuki, THirashima, SMizutani, KYoshida, AAndo, IIkeda, SAdachi, THashimoto, H Benzimidazole inhibitors of hepatitis C virus NS5B polymerase: identification of 2-[(4-diarylmethoxy)phenyl]-benzimidazole. Bioorg Med Chem Lett16:1859-63 (2006) 
 
RNA-directed RNA polymerase
Name:RNA-directed RNA polymerase
Type:Protein
Mol. Mass.:25173.95
Organism:Hepatitis C virus
Description:Q8JXU8
Residue:229
BDBM50181948
NameBDBM50181948
Synonyms:2-(4-(2-chlorobenzyloxy)phenyl)-1-cyclopentyl-1H-benzo[d]imidazole-5-carboxylic acid | CHEMBL204722
TypeSmall organic molecule
Emp. Form.C26H23ClN2O3
Mol. Mass.446.925
SMILESOC(=O)c1ccc2n(C3CCCC3)c(nc2c1)-c1ccc(OCc2ccccc2Cl)cc1