Reaction Details
TargetRNA-directed RNA polymerase
LigandBDBM50181932
Substrate/Competitorn/a
Meas. Tech.ChEMBL_345619 (CHEMBL860686)
IC50 2400±n/a nM
Citation Ishida, TSuzuki, THirashima, SMizutani, KYoshida, AAndo, IIkeda, SAdachi, THashimoto, H Benzimidazole inhibitors of hepatitis C virus NS5B polymerase: identification of 2-[(4-diarylmethoxy)phenyl]-benzimidazole. Bioorg Med Chem Lett16:1859-63 (2006) 
 
RNA-directed RNA polymerase
Name:RNA-directed RNA polymerase
Type:Protein
Mol. Mass.:25173.95
Organism:Hepatitis C virus
Description:Q8JXU8
Residue:229
BDBM50181932
NameBDBM50181932
Synonyms:2-(4-(bis(4-chlorophenyl)methoxy)phenyl)-1-cyclohexyl-1H-benzo[d]imidazole-5-carboxylic acid | CHEMBL426850
TypeSmall organic molecule
Emp. Form.C33H28Cl2N2O3
Mol. Mass.571.493
SMILESOC(=O)c1ccc2n(C3CCCCC3)c(nc2c1)-c1ccc(OC(c2ccc(Cl)cc2)c2ccc(Cl)cc2)cc1