Reaction Details
TargetDNA polymerase alpha catalytic subunit
LigandBDBM50181932
Substrate/Competitorn/a
Meas. Tech.ChEMBL_345623 (CHEMBL859711)
IC50>10000±n/a nM
Citation Ishida, TSuzuki, THirashima, SMizutani, KYoshida, AAndo, IIkeda, SAdachi, THashimoto, H Benzimidazole inhibitors of hepatitis C virus NS5B polymerase: identification of 2-[(4-diarylmethoxy)phenyl]-benzimidazole. Bioorg Med Chem Lett16:1859-63 (2006) 
 
DNA polymerase alpha catalytic subunit
Name:DNA polymerase alpha catalytic subunit
Type:PROTEIN
Mol. Mass.:165895.25
Organism:Homo sapiens (Human)
Description:ChEMBL_1365493
Residue:1462
BDBM50181932
NameBDBM50181932
Synonyms:2-(4-(bis(4-chlorophenyl)methoxy)phenyl)-1-cyclohexyl-1H-benzo[d]imidazole-5-carboxylic acid | CHEMBL426850
TypeSmall organic molecule
Emp. Form.C33H28Cl2N2O3
Mol. Mass.571.493
SMILESOC(=O)c1ccc2n(C3CCCCC3)c(nc2c1)-c1ccc(OC(c2ccc(Cl)cc2)c2ccc(Cl)cc2)cc1