Reaction Details
TargetPolyunsaturated fatty acid 5-lipoxygenase
LigandBDBM50182308
Substrate/Competitorn/a
Meas. Tech.ChEMBL_351708 (CHEMBL870097)
IC50 9±n/a nM
Citation Grimm, ELBrideau, CChauret, NChan, CCDelorme, DDucharme, YEthier, DFalgueyret, JPFriesen, RWGuay, JHamel, PRiendeau, DSoucy-Breau, CTagari, PGirard, Y Substituted coumarins as potent 5-lipoxygenase inhibitors. Bioorg Med Chem Lett16:2528-31 (2006) 
 
Polyunsaturated fatty acid 5-lipoxygenase
Name:Polyunsaturated fatty acid 5-lipoxygenase
Type:Enzyme
Mol. Mass.:77972.74
Organism:Homo sapiens (Human)
Description:Recombinant protein was purified from E. coli lysate. After ammonium sulfate precipitation and subsequent steps, the supernatant (S100) was used for 5-LO activity assay.
Residue:674
BDBM50182308
NameBDBM50182308
Synonyms:7-(3-fluoro-5-(1,1,1,3,3,3-hexafluoro-2-hydroxypropan-2-yl)phenylthio)-4-(furan-3-yl)-2H-chromen-2-one | CHEMBL377094
TypeSmall organic molecule
Emp. Form.C22H11F7O4S
Mol. Mass.504.374
SMILESOC(c1cc(F)cc(Sc2ccc3c(cc(=O)oc3c2)-c2ccoc2)c1)(C(F)(F)F)C(F)(F)F