Reaction Details
TargetC-C chemokine receptor type 4
LigandBDBM50183102
Substrate/Competitorn/a
Meas. Tech.ChEMBL_350559 (CHEMBL870148)
IC50 37±n/a nM
Citation Wang, XXu, FXu, QMahmud, HHouze, JZhu, LAkerman, MTonn, GTang, LMcMaster, BEDairaghi, DJSchall, TJCollins, TLMedina, JC Optimization of 2-aminothiazole derivatives as CCR4 antagonists. Bioorg Med Chem Lett16:2800-3 (2006) 
 
C-C chemokine receptor type 4
Name:C-C chemokine receptor type 4
Type:Enzyme
Mol. Mass.:41406.41
Organism:Homo sapiens (Human)
Description:P51679
Residue:360
BDBM50183102
NameBDBM50183102
Synonyms:CHEMBL205279 | N-(4-tert-butylthiazol-2-yl)-1-methyl-1H-indol-4-amine
TypeSmall organic molecule
Emp. Form.C16H19N3S
Mol. Mass.285.407
SMILESCn1ccc2c(Nc3nc(cs3)C(C)(C)C)cccc12