Reaction Details
TargetC-C chemokine receptor type 4
LigandBDBM50183106
Substrate/Competitorn/a
Meas. Tech.ChEMBL_350559 (CHEMBL870148)
IC50 900±n/a nM
Citation Wang, XXu, FXu, QMahmud, HHouze, JZhu, LAkerman, MTonn, GTang, LMcMaster, BEDairaghi, DJSchall, TJCollins, TLMedina, JC Optimization of 2-aminothiazole derivatives as CCR4 antagonists. Bioorg Med Chem Lett16:2800-3 (2006) 
 
C-C chemokine receptor type 4
Name:C-C chemokine receptor type 4
Type:Enzyme
Mol. Mass.:41406.41
Organism:Homo sapiens (Human)
Description:P51679
Residue:360
BDBM50183106
NameBDBM50183106
Synonyms:4-(4-tert-butylphenyl)-N-(naphthalen-1-yl)thiazol-2-amine | CHEMBL205490
TypeSmall organic molecule
Emp. Form.C23H22N2S
Mol. Mass.358.499
SMILESCC(C)(C)c1ccc(cc1)-c1csc(Nc2cccc3ccccc23)n1