Reaction Details
TargetProcathepsin L
LigandBDBM50033762
Substrate/Competitorn/a
Meas. Tech.ChEMBL_2241126 (CHEMBL5155336)
Ki 5.3±n/a nM
Citation Ashhurst, ASTang, AHFajtová, PYoon, MCAggarwal, ABedding, MJStoye, ABeretta, LPwee, DDrelich, ASkinner, DLi, LMeek, TDMcKerrow, JHHook, VTseng, CTLarance, MTurville, SGerwick, WHO'Donoghue, AJPayne, RJ Potent Anti-SARS-CoV-2 Activity by the Natural Product Gallinamide A and Analogues via Inhibition of Cathepsin L. J Med Chem65:2956-2970 (2022) 
 
Procathepsin L
Name:Procathepsin L
Type:PROTEIN
Mol. Mass.:37548.98
Organism:Mus musculus
Description:n/a
Residue:334
BDBM50033762
NameBDBM50033762
Synonyms:Gallinamide A
TypeSmall organic molecule
Emp. Form.C31H52N4O7
Mol. Mass.592.7672
SMILESCC[C@H](C)[C@H](N(C)C)C(=O)O[C@@H](CC(C)C)C(=O)N[C@@H](CC(C)C)C(=O)N[C@@H](C)\C=C\C(=O)N1[C@@H](C)C(OC)=CC1=O