Reaction Details
TargetProcathepsin L
LigandBDBM50602542
Substrate/Competitorn/a
Meas. Tech.ChEMBL_2241126 (CHEMBL5155336)
Ki 29.3±n/a nM
Citation Ashhurst, ASTang, AHFajtová, PYoon, MCAggarwal, ABedding, MJStoye, ABeretta, LPwee, DDrelich, ASkinner, DLi, LMeek, TDMcKerrow, JHHook, VTseng, CTLarance, MTurville, SGerwick, WHO'Donoghue, AJPayne, RJ Potent Anti-SARS-CoV-2 Activity by the Natural Product Gallinamide A and Analogues via Inhibition of Cathepsin L. J Med Chem65:2956-2970 (2022) 
 
Procathepsin L
Name:Procathepsin L
Type:PROTEIN
Mol. Mass.:37548.98
Organism:Mus musculus
Description:n/a
Residue:334
BDBM50602542
NameBDBM50602542
Synonyms:CHEMBL4594870
TypeSmall organic molecule
Emp. Form.C41H58N6O6
Mol. Mass.730.9358
SMILESCOC1=CC(=O)N([C@H]1Cc1c[nH]c2ccccc12)C(=O)\C=C\[C@H](C)NC(=O)[C@H](CC(C)C)NC(=O)[C@H](CC1CCCCC1)NC(=O)C1CCN(C)CC1