Reaction Details
TargetProcathepsin L
LigandBDBM50602543
Substrate/Competitorn/a
Meas. Tech.ChEMBL_2241126 (CHEMBL5155336)
Ki 16.5±n/a nM
Citation Ashhurst, ASTang, AHFajtová, PYoon, MCAggarwal, ABedding, MJStoye, ABeretta, LPwee, DDrelich, ASkinner, DLi, LMeek, TDMcKerrow, JHHook, VTseng, CTLarance, MTurville, SGerwick, WHO'Donoghue, AJPayne, RJ Potent Anti-SARS-CoV-2 Activity by the Natural Product Gallinamide A and Analogues via Inhibition of Cathepsin L. J Med Chem65:2956-2970 (2022) 
 
Procathepsin L
Name:Procathepsin L
Type:PROTEIN
Mol. Mass.:37548.98
Organism:Mus musculus
Description:n/a
Residue:334
BDBM50602543
NameBDBM50602543
Synonyms:CHEMBL4598338
TypeSmall organic molecule
Emp. Form.C45H60N6O6
Mol. Mass.780.9945
SMILESCOC1=CC(=O)N([C@H]1Cc1c[nH]c2ccccc12)C(=O)\C=C\[C@H](C)NC(=O)[C@H](CCc1ccccc1)NC(=O)[C@H](CC1CCCCC1)NC(=O)[C@H](C(C)C)N(C)C