Reaction Details
TargetSodium-dependent dopamine transporter
LigandBDBM50183537
Substrate/Competitorn/a
Meas. Tech.ChEMBL_335142 (CHEMBL867622)
Ki 6.3±n/a nM
Citation Greiner, EBoos, TLPrisinzano, TEDe Martino, MGZeglis, BDersch, CMMarcus, JPartilla, JSRothman, RBJacobson, AERice, KC Design and synthesis of promiscuous high-affinity monoamine transporter ligands: unraveling transporter selectivity. J Med Chem49:1766-72 (2006) 
 
Sodium-dependent dopamine transporter
Name:Sodium-dependent dopamine transporter
Type:Multi-pass membrane protein
Mol. Mass.:68497.11
Organism:Homo sapiens (Human)
Description:Q01959
Residue:620
BDBM50183537
NameBDBM50183537
Synonyms:(S)-(+)-1-(2-amino-3-phenylpropyl)-4-[2-[bis-(4-fluorophenyl)-methoxy]ethyl]piperidine dioxalate | CHEMBL381842
TypeSmall organic molecule
Emp. Form.C29H34F2N2O
Mol. Mass.464.5899
SMILESN[C@H](CN1CCC(CCOC(c2ccc(F)cc2)c2ccc(F)cc2)CC1)Cc1ccccc1