Reaction Details
TargetSodium-dependent noradrenaline transporter
LigandBDBM50183532
Substrate/Competitorn/a
Meas. Tech.ChEMBL_335144 (CHEMBL867624)
Ki 43±n/a nM
Citation Greiner, EBoos, TLPrisinzano, TEDe Martino, MGZeglis, BDersch, CMMarcus, JPartilla, JSRothman, RBJacobson, AERice, KC Design and synthesis of promiscuous high-affinity monoamine transporter ligands: unraveling transporter selectivity. J Med Chem49:1766-72 (2006) 
 
Sodium-dependent noradrenaline transporter
Name:Sodium-dependent noradrenaline transporter
Type:Multi-pass membrane protein
Mol. Mass.:69337.72
Organism:Homo sapiens (Human)
Description:P23975
Residue:617
BDBM50183532
NameBDBM50183532
Synonyms:4-[2-[bis-(4-fluorophenyl)methoxy]ethyl]-1-(3,4-dihydronaphthalen-2-ylmethyl)-piperidine oxalate | CHEMBL205005
TypeSmall organic molecule
Emp. Form.C31H33F2NO
Mol. Mass.473.5966
SMILESFc1ccc(cc1)C(OCCC1CCN(CC2=Cc3ccccc3CC2)CC1)c1ccc(F)cc1