Reaction Details
TargetSodium-dependent serotonin transporter
LigandBDBM50183542
Substrate/Competitorn/a
Meas. Tech.ChEMBL_335143 (CHEMBL867623)
Ki 38±n/a nM
Citation Greiner, EBoos, TLPrisinzano, TEDe Martino, MGZeglis, BDersch, CMMarcus, JPartilla, JSRothman, RBJacobson, AERice, KC Design and synthesis of promiscuous high-affinity monoamine transporter ligands: unraveling transporter selectivity. J Med Chem49:1766-72 (2006) 
 
Sodium-dependent serotonin transporter
Name:Sodium-dependent serotonin transporter
Type:Multi-pass membrane protein
Mol. Mass.:70322.51
Organism:Homo sapiens (Human)
Description:P31645
Residue:630
BDBM50183542
NameBDBM50183542
Synonyms:(S)-(-)-4-[2-[bis-(4-fluorophenyl)methoxy]ethyl]-1-(4-phenylbutan-2-ol)-piperidine oxalate | CHEMBL383464
TypeSmall organic molecule
Emp. Form.C30H35F2NO2
Mol. Mass.479.6012
SMILESO[C@@H](CCc1ccccc1)CN1CCC(CCOC(c2ccc(F)cc2)c2ccc(F)cc2)CC1