Reaction Details
TargetSodium-dependent noradrenaline transporter
LigandBDBM50183546
Substrate/Competitorn/a
Meas. Tech.ChEMBL_335149 (CHEMBL867629)
Ki 40±n/a nM
Citation Greiner, EBoos, TLPrisinzano, TEDe Martino, MGZeglis, BDersch, CMMarcus, JPartilla, JSRothman, RBJacobson, AERice, KC Design and synthesis of promiscuous high-affinity monoamine transporter ligands: unraveling transporter selectivity. J Med Chem49:1766-72 (2006) 
 
Sodium-dependent noradrenaline transporter
Name:Sodium-dependent noradrenaline transporter
Type:Multi-pass membrane protein
Mol. Mass.:69337.72
Organism:Homo sapiens (Human)
Description:P23975
Residue:617
BDBM50183546
NameBDBM50183546
Synonyms:CHEMBL383071 | S-(+)-4-[2-[bis-(4-fluorophenyl)methoxy]ethyl]-1-(3-phenylbutyl)-piperidine oxalate
TypeSmall organic molecule
Emp. Form.C30H35F2NO
Mol. Mass.463.6018
SMILESC[C@@H](CCN1CCC(CCOC(c2ccc(F)cc2)c2ccc(F)cc2)CC1)c1ccccc1