Reaction Details
TargetSodium-dependent serotonin transporter
LigandBDBM50183541
Substrate/Competitorn/a
Meas. Tech.ChEMBL_335143 (CHEMBL867623)
Ki 58±n/a nM
Citation Greiner, EBoos, TLPrisinzano, TEDe Martino, MGZeglis, BDersch, CMMarcus, JPartilla, JSRothman, RBJacobson, AERice, KC Design and synthesis of promiscuous high-affinity monoamine transporter ligands: unraveling transporter selectivity. J Med Chem49:1766-72 (2006) 
 
Sodium-dependent serotonin transporter
Name:Sodium-dependent serotonin transporter
Type:Multi-pass membrane protein
Mol. Mass.:70322.51
Organism:Homo sapiens (Human)
Description:P31645
Residue:630
BDBM50183541
NameBDBM50183541
Synonyms:CHEMBL424682 | R-(-)-4-[2-[bis-(4-fluorophenyl)methoxy]ethyl]-1-(3-phenylbutyl)-piperidine oxalate
TypeSmall organic molecule
Emp. Form.C30H35F2NO
Mol. Mass.463.6018
SMILESC[C@H](CCN1CCC(CCOC(c2ccc(F)cc2)c2ccc(F)cc2)CC1)c1ccccc1