Reaction Details
TargetSodium-dependent noradrenaline transporter
LigandBDBM50183549
Substrate/Competitorn/a
Meas. Tech.ChEMBL_335144 (CHEMBL867624)
Ki 361±n/a nM
Citation Greiner, EBoos, TLPrisinzano, TEDe Martino, MGZeglis, BDersch, CMMarcus, JPartilla, JSRothman, RBJacobson, AERice, KC Design and synthesis of promiscuous high-affinity monoamine transporter ligands: unraveling transporter selectivity. J Med Chem49:1766-72 (2006) 
 
Sodium-dependent noradrenaline transporter
Name:Sodium-dependent noradrenaline transporter
Type:Multi-pass membrane protein
Mol. Mass.:69337.72
Organism:Homo sapiens (Human)
Description:P23975
Residue:617
BDBM50183549
NameBDBM50183549
Synonyms:(S)-(+)-4-[2-[bis-(4-fluorophenyl)methoxy]ethyl]-1-(3-phenylpropan-2-ol)-piperidine oxalate | CHEMBL380406
TypeSmall organic molecule
Emp. Form.C29H33F2NO2
Mol. Mass.465.5746
SMILESO[C@H](CN1CCC(CCOC(c2ccc(F)cc2)c2ccc(F)cc2)CC1)Cc1ccccc1