Reaction Details
TargetSodium-dependent dopamine transporter
LigandBDBM50183543
Substrate/Competitorn/a
Meas. Tech.ChEMBL_335142 (CHEMBL867622)
Ki 5.1±n/a nM
Citation Greiner, EBoos, TLPrisinzano, TEDe Martino, MGZeglis, BDersch, CMMarcus, JPartilla, JSRothman, RBJacobson, AERice, KC Design and synthesis of promiscuous high-affinity monoamine transporter ligands: unraveling transporter selectivity. J Med Chem49:1766-72 (2006) 
 
Sodium-dependent dopamine transporter
Name:Sodium-dependent dopamine transporter
Type:Multi-pass membrane protein
Mol. Mass.:68497.11
Organism:Homo sapiens (Human)
Description:Q01959
Residue:620
BDBM50183543
NameBDBM50183543
Synonyms:(R)-(-)-4-[2-[bis-(4-fluorophenyl)methoxy]ethyl]-1-(3-phenylpropan-2-ol)-piperidine oxalate | CHEMBL204530
TypeSmall organic molecule
Emp. Form.C29H33F2NO2
Mol. Mass.465.5746
SMILESO[C@@H](CN1CCC(CCOC(c2ccc(F)cc2)c2ccc(F)cc2)CC1)Cc1ccccc1