Reaction Details
TargetSodium-dependent dopamine transporter
LigandBDBM50183548
Substrate/Competitorn/a
Meas. Tech.ChEMBL_335142 (CHEMBL867622)
Ki 1.4±n/a nM
Citation Greiner, EBoos, TLPrisinzano, TEDe Martino, MGZeglis, BDersch, CMMarcus, JPartilla, JSRothman, RBJacobson, AERice, KC Design and synthesis of promiscuous high-affinity monoamine transporter ligands: unraveling transporter selectivity. J Med Chem49:1766-72 (2006) 
 
Sodium-dependent dopamine transporter
Name:Sodium-dependent dopamine transporter
Type:Multi-pass membrane protein
Mol. Mass.:68497.11
Organism:Homo sapiens (Human)
Description:Q01959
Residue:620
BDBM50183548
NameBDBM50183548
Synonyms:(S)-(+)-4-(2-benzhydryloxyethyl)-1-(3-phenylpropan-2-ol)-piperidine oxalate | CHEMBL204586
TypeSmall organic molecule
Emp. Form.C29H35NO2
Mol. Mass.429.5937
SMILESO[C@H](CN1CCC(CCOC(c2ccccc2)c2ccccc2)CC1)Cc1ccccc1