Reaction Details
TargetMatrix metalloproteinase-9
LigandBDBM50183735
Substrate/Competitorn/a
Meas. Tech.ChEMBL_354461 (CHEMBL853096)
Ki>2128±n/a nM
Citation Gilmore, JLKing, BWHarris, CMaduskuie, TMercer, SELiu, RQCovington, MBQian, MRibadeneria, MDVaddi, KTrzaskos, JMNewton, RCDecicco, CPDuan, JJ Synthesis and structure-activity relationship of a novel, achiral series of TNF-alpha converting enzyme inhibitors. Bioorg Med Chem Lett16:2699-704 (2006) 
 
Matrix metalloproteinase-9
Name:Matrix metalloproteinase-9
Type:Enzyme
Mol. Mass.:78452.28
Organism:Homo sapiens (Human)
Description:P14780
Residue:707
BDBM50183735
NameBDBM50183735
Synonyms:CHEMBL205290 | N-(1-(2-(hydroxyamino)-2-oxoethyl)cyclohexyl)-4-((2-methylquinolin-4-yl)methoxy)benzamide
TypeSmall organic molecule
Emp. Form.C26H29N3O4
Mol. Mass.447.5262
SMILESCc1cc(COc2ccc(cc2)C(=O)NC2(CC(=O)NO)CCCCC2)c2ccccc2n1