Reaction Details
TargetCysteine protease
LigandBDBM50183747
Substrate/Competitorn/a
Meas. Tech.ChEMBL_350622 (CHEMBL869006)
Ki 2800±n/a nM
Citation Vicik, RHoerr, VGlaser, MSchultheis, MHansell, EMcKerrow, JHHolzgrabe, UCaffrey, CRPonte-Sucre, AMoll, HStich, ASchirmeister, T Aziridine-2,3-dicarboxylate inhibitors targeting the major cysteine protease of Trypanosoma brucei as lead trypanocidal agents. Bioorg Med Chem Lett16:2753-7 (2006) 
 
Cysteine protease
Name:Cysteine protease
Synonyms:Rhodesain
Type:PROTEIN
Mol. Mass.:48425.78
Organism:Trypanosoma brucei rhodesiense
Description:ChEMBL_619861
Residue:450
BDBM50183747
NameBDBM50183747
TypeSmall organic molecule
Emp. Form.C34H43N3O8
Mol. Mass.621.7205
SMILESCC(C)C[C@@H](NC(=O)OC(C)(C)C)C(=O)N1CCC[C@@H]1C(=O)N1[C@@H]([C@H]1C(=O)OCc1ccccc1)C(=O)OCc1ccccc1