Reaction Details
TargetEpidermal growth factor receptor
LigandBDBM50183842
Substrate/Competitorn/a
Meas. Tech.ChEMBL_354894 (CHEMBL853149)
IC50 30±n/a nM
Citation Hennequin, LFBallard, PBoyle, FTDelouvrié, BEllston, RPHalsall, CTHarris, CSHudson, KKendrew, JPease, JERoss, HSSmith, PVincent, JL Novel 4-anilinoquinazolines with C-6 carbon-linked side chains: synthesis and structure-activity relationship of a series of potent, orally active, EGF receptor tyrosine kinase inhibitors. Bioorg Med Chem Lett16:2672-6 (2006) 
 
Epidermal growth factor receptor
Name:Epidermal growth factor receptor
Type:Receptor Kinase Domain
Mol. Mass.:134279.59
Organism:Homo sapiens (Human)
Description:P00533
Residue:1210
BDBM50183842
NameBDBM50183842
Synonyms:(S)-1-((4-(3-chloro-2-fluorophenylamino)-7-methoxyquinazolin-6-yl)methyl)pyrrolidine-2-carboxamide | CHEMBL207584
TypeSmall organic molecule
Emp. Form.C21H21ClFN5O2
Mol. Mass.429.875
SMILESCOc1cc2ncnc(Nc3cccc(Cl)c3F)c2cc1CN1CCC[C@H]1C(N)=O