Reaction Details
TargetEpidermal growth factor receptor
LigandBDBM50183864
Substrate/Competitorn/a
Meas. Tech.ChEMBL_354894 (CHEMBL853149)
IC50 8.00±n/a nM
Citation Hennequin, LFBallard, PBoyle, FTDelouvrié, BEllston, RPHalsall, CTHarris, CSHudson, KKendrew, JPease, JERoss, HSSmith, PVincent, JL Novel 4-anilinoquinazolines with C-6 carbon-linked side chains: synthesis and structure-activity relationship of a series of potent, orally active, EGF receptor tyrosine kinase inhibitors. Bioorg Med Chem Lett16:2672-6 (2006) 
 
Epidermal growth factor receptor
Name:Epidermal growth factor receptor
Type:Receptor Kinase Domain
Mol. Mass.:134279.59
Organism:Homo sapiens (Human)
Description:P00533
Residue:1210
BDBM50183864
NameBDBM50183864
Synonyms:(R)-1-((4-(3-chloro-2-fluorophenylamino)-7-methoxyquinazolin-6-yl)methyl)piperidine-2-carboxamide | CHEMBL206783
TypeSmall organic molecule
Emp. Form.C22H23ClFN5O2
Mol. Mass.443.902
SMILESCOc1cc2ncnc(Nc3cccc(Cl)c3F)c2cc1CN1CCCC[C@@H]1C(N)=O