Reaction Details
TargetMelanin-concentrating hormone receptor 1
LigandBDBM50183954
Substrate/Competitorn/a
Meas. Tech.ChEMBL_353887 (CHEMBL865034)
IC50 29±n/a nM
Citation Blackburn, CLaMarche, MJBrown, JChe, JLCullis, CALai, SMaguire, MMarsilje, TGeddes, BGovek, EKadambi, VDoherty, CDayton, BBrodjian, SMarsh, KCCollins, CAKym, PR Identification and characterization of amino-piperidinequinolones and quinazolinones as MCHr1 antagonists. Bioorg Med Chem Lett16:2621-7 (2006) 
 
Melanin-concentrating hormone receptor 1
Name:Melanin-concentrating hormone receptor 1
Type:G Protein-Coupled Receptor (GPCR)
Mol. Mass.:45976.27
Organism:Homo sapiens (Human)
Description:Membranes from CHO-K1 cells stably expressing human MCH1R were used in assays.
Residue:422
BDBM50183954
NameBDBM50183954
Synonyms:4-(1-(benzo[d][1,3]dioxol-5-ylmethyl)piperidin-4-ylamino)-6-chloro-1-(pyridin-4-ylmethyl)quinolin-2(1H)-one | CHEMBL208473
TypeSmall organic molecule
Emp. Form.C28H27ClN4O3
Mol. Mass.502.992
SMILESClc1ccc2n(Cc3ccncc3)c(=O)cc(NC3CCN(Cc4ccc5OCOc5c4)CC3)c2c1