Reaction Details
TargetMelanin-concentrating hormone receptor 1
LigandBDBM50183955
Substrate/Competitorn/a
Meas. Tech.ChEMBL_353886 (CHEMBL865033)
IC50 12±n/a nM
Citation Blackburn, CLaMarche, MJBrown, JChe, JLCullis, CALai, SMaguire, MMarsilje, TGeddes, BGovek, EKadambi, VDoherty, CDayton, BBrodjian, SMarsh, KCCollins, CAKym, PR Identification and characterization of amino-piperidinequinolones and quinazolinones as MCHr1 antagonists. Bioorg Med Chem Lett16:2621-7 (2006) 
 
Melanin-concentrating hormone receptor 1
Name:Melanin-concentrating hormone receptor 1
Type:G Protein-Coupled Receptor (GPCR)
Mol. Mass.:45976.27
Organism:Homo sapiens (Human)
Description:Membranes from CHO-K1 cells stably expressing human MCH1R were used in assays.
Residue:422
BDBM50183955
NameBDBM50183955
Synonyms:6-chloro-1-methyl-4-(1-(naphthalen-2-ylmethyl)piperidin-4-ylamino)-2-oxo-1,2-dihydroquinoline-3-carbonitrile | CHEMBL207257
TypeSmall organic molecule
Emp. Form.C27H25ClN4O
Mol. Mass.456.967
SMILESCn1c2ccc(Cl)cc2c(NC2CCN(Cc3ccc4ccccc4c3)CC2)c(C#N)c1=O