Reaction Details
TargetMelanin-concentrating hormone receptor 1
LigandBDBM50183959
Substrate/Competitorn/a
Meas. Tech.ChEMBL_353887 (CHEMBL865034)
IC50 34±n/a nM
Citation Blackburn, CLaMarche, MJBrown, JChe, JLCullis, CALai, SMaguire, MMarsilje, TGeddes, BGovek, EKadambi, VDoherty, CDayton, BBrodjian, SMarsh, KCCollins, CAKym, PR Identification and characterization of amino-piperidinequinolones and quinazolinones as MCHr1 antagonists. Bioorg Med Chem Lett16:2621-7 (2006) 
 
Melanin-concentrating hormone receptor 1
Name:Melanin-concentrating hormone receptor 1
Type:G Protein-Coupled Receptor (GPCR)
Mol. Mass.:45976.27
Organism:Homo sapiens (Human)
Description:Membranes from CHO-K1 cells stably expressing human MCH1R were used in assays.
Residue:422
BDBM50183959
NameBDBM50183959
Synonyms:4-(1-(benzo[d][1,3]dioxol-5-ylmethyl)piperidin-4-ylamino)-6-(difluoromethoxy)-1-methylquinolin-2(1H)-one | CHEMBL206030
TypeSmall organic molecule
Emp. Form.C24H25F2N3O4
Mol. Mass.457.4698
SMILESCn1c2ccc(OC(F)F)cc2c(NC2CCN(Cc3ccc4OCOc4c3)CC2)cc1=O