Reaction Details
TargetMelanin-concentrating hormone receptor 1
LigandBDBM50183963
Substrate/Competitorn/a
Meas. Tech.ChEMBL_353886 (CHEMBL865033)
IC50 34±n/a nM
Citation Blackburn, CLaMarche, MJBrown, JChe, JLCullis, CALai, SMaguire, MMarsilje, TGeddes, BGovek, EKadambi, VDoherty, CDayton, BBrodjian, SMarsh, KCCollins, CAKym, PR Identification and characterization of amino-piperidinequinolones and quinazolinones as MCHr1 antagonists. Bioorg Med Chem Lett16:2621-7 (2006) 
 
Melanin-concentrating hormone receptor 1
Name:Melanin-concentrating hormone receptor 1
Type:G Protein-Coupled Receptor (GPCR)
Mol. Mass.:45976.27
Organism:Homo sapiens (Human)
Description:Membranes from CHO-K1 cells stably expressing human MCH1R were used in assays.
Residue:422
BDBM50183963
NameBDBM50183963
Synonyms:4-(1-(benzo[d][1,3]dioxol-5-ylmethyl)piperidin-4-ylamino)-1-methyl-6-(trifluoromethoxy)quinolin-2(1H)-one | CHEMBL210273
TypeSmall organic molecule
Emp. Form.C24H24F3N3O4
Mol. Mass.475.4603
SMILESCn1c2ccc(OC(F)(F)F)cc2c(NC2CCN(Cc3ccc4OCOc4c3)CC2)cc1=O