Reaction Details
TargetMelanin-concentrating hormone receptor 1
LigandBDBM50183965
Substrate/Competitorn/a
Meas. Tech.ChEMBL_353886 (CHEMBL865033)
IC50 0.9±n/a nM
Citation Blackburn, CLaMarche, MJBrown, JChe, JLCullis, CALai, SMaguire, MMarsilje, TGeddes, BGovek, EKadambi, VDoherty, CDayton, BBrodjian, SMarsh, KCCollins, CAKym, PR Identification and characterization of amino-piperidinequinolones and quinazolinones as MCHr1 antagonists. Bioorg Med Chem Lett16:2621-7 (2006) 
 
Melanin-concentrating hormone receptor 1
Name:Melanin-concentrating hormone receptor 1
Type:G Protein-Coupled Receptor (GPCR)
Mol. Mass.:45976.27
Organism:Homo sapiens (Human)
Description:Membranes from CHO-K1 cells stably expressing human MCH1R were used in assays.
Residue:422
BDBM50183965
NameBDBM50183965
Synonyms:6-chloro-4-(1-(naphthalen-2-ylmethyl)piperidin-4-ylamino)-1-(pyridin-2-ylmethyl)quinolin-2(1H)-one | CHEMBL377084
TypeSmall organic molecule
Emp. Form.C31H29ClN4O
Mol. Mass.509.041
SMILESClc1ccc2n(Cc3ccccn3)c(=O)cc(NC3CCN(Cc4ccc5ccccc5c4)CC3)c2c1