Reaction Details
TargetMelanin-concentrating hormone receptor 1
LigandBDBM50183970
Substrate/Competitorn/a
Meas. Tech.ChEMBL_353886 (CHEMBL865033)
IC50 12±n/a nM
Citation Blackburn, CLaMarche, MJBrown, JChe, JLCullis, CALai, SMaguire, MMarsilje, TGeddes, BGovek, EKadambi, VDoherty, CDayton, BBrodjian, SMarsh, KCCollins, CAKym, PR Identification and characterization of amino-piperidinequinolones and quinazolinones as MCHr1 antagonists. Bioorg Med Chem Lett16:2621-7 (2006) 
 
Melanin-concentrating hormone receptor 1
Name:Melanin-concentrating hormone receptor 1
Type:G Protein-Coupled Receptor (GPCR)
Mol. Mass.:45976.27
Organism:Homo sapiens (Human)
Description:Membranes from CHO-K1 cells stably expressing human MCH1R were used in assays.
Residue:422
BDBM50183970
NameBDBM50183970
Synonyms:6-chloro-1-methyl-4-(1-(quinolin-6-ylmethyl)piperidin-4-ylamino)quinazolin-2(1H)-one | CHEMBL207308
TypeSmall organic molecule
Emp. Form.C24H24ClN5O
Mol. Mass.433.933
SMILESCn1c2ccc(Cl)cc2c(NC2CCN(Cc3ccc4ncccc4c3)CC2)nc1=O