Reaction Details
TargetMelanin-concentrating hormone receptor 1
LigandBDBM50183971
Substrate/Competitorn/a
Meas. Tech.ChEMBL_353887 (CHEMBL865034)
IC50 62±n/a nM
Citation Blackburn, CLaMarche, MJBrown, JChe, JLCullis, CALai, SMaguire, MMarsilje, TGeddes, BGovek, EKadambi, VDoherty, CDayton, BBrodjian, SMarsh, KCCollins, CAKym, PR Identification and characterization of amino-piperidinequinolones and quinazolinones as MCHr1 antagonists. Bioorg Med Chem Lett16:2621-7 (2006) 
 
Melanin-concentrating hormone receptor 1
Name:Melanin-concentrating hormone receptor 1
Type:G Protein-Coupled Receptor (GPCR)
Mol. Mass.:45976.27
Organism:Homo sapiens (Human)
Description:Membranes from CHO-K1 cells stably expressing human MCH1R were used in assays.
Residue:422
BDBM50183971
NameBDBM50183971
Synonyms:6-chloro-4-(1-(naphthalen-2-ylmethyl)piperidin-4-ylamino)-1-(2,2,2-trifluoroethyl)quinazolin-2(1H)-one | CHEMBL204508
TypeSmall organic molecule
Emp. Form.C26H24ClF3N4O
Mol. Mass.500.943
SMILESFC(F)(F)Cn1c2ccc(Cl)cc2c(NC2CCN(Cc3ccc4ccccc4c3)CC2)nc1=O