Reaction Details
TargetPotassium voltage-gated channel subfamily H member 2
LigandBDBM50183973
Substrate/Competitorn/a
Meas. Tech.ChEMBL_353888 (CHEMBL865039)
Ki 420±n/a nM
Citation Blackburn, CLaMarche, MJBrown, JChe, JLCullis, CALai, SMaguire, MMarsilje, TGeddes, BGovek, EKadambi, VDoherty, CDayton, BBrodjian, SMarsh, KCCollins, CAKym, PR Identification and characterization of amino-piperidinequinolones and quinazolinones as MCHr1 antagonists. Bioorg Med Chem Lett16:2621-7 (2006) 
 
Potassium voltage-gated channel subfamily H member 2
Name:Potassium voltage-gated channel subfamily H member 2
Type:Multi-pass membrane protein
Mol. Mass.:126672.65
Organism:Homo sapiens (Human)
Description:Q12809
Residue:1159
BDBM50183973
NameBDBM50183973
Synonyms:4-(1-(benzo[d][1,3]dioxol-5-ylmethyl)piperidin-4-ylamino)-6-chloro-2-oxo-1,2-dihydroquinoline-3-carbonitrile | CHEMBL424865
TypeSmall organic molecule
Emp. Form.C23H21ClN4O3
Mol. Mass.436.891
SMILESClc1ccc2[nH]c(=O)c(C#N)c(NC3CCN(Cc4ccc5OCOc5c4)CC3)c2c1