Reaction Details
TargetMelanin-concentrating hormone receptor 1
LigandBDBM50183968
Substrate/Competitorn/a
Meas. Tech.ChEMBL_353886 (CHEMBL865033)
IC50 7±n/a nM
Citation Blackburn, CLaMarche, MJBrown, JChe, JLCullis, CALai, SMaguire, MMarsilje, TGeddes, BGovek, EKadambi, VDoherty, CDayton, BBrodjian, SMarsh, KCCollins, CAKym, PR Identification and characterization of amino-piperidinequinolones and quinazolinones as MCHr1 antagonists. Bioorg Med Chem Lett16:2621-7 (2006) 
 
Melanin-concentrating hormone receptor 1
Name:Melanin-concentrating hormone receptor 1
Type:G Protein-Coupled Receptor (GPCR)
Mol. Mass.:45976.27
Organism:Homo sapiens (Human)
Description:Membranes from CHO-K1 cells stably expressing human MCH1R were used in assays.
Residue:422
BDBM50183968
NameBDBM50183968
Synonyms:6-chloro-1-methyl-4-(1-(naphthalen-2-ylmethyl)piperidin-4-ylamino)quinazolin-2(1H)-one | CHEMBL207296
TypeSmall organic molecule
Emp. Form.C25H25ClN4O
Mol. Mass.432.945
SMILESCn1c2ccc(Cl)cc2c(NC2CCN(Cc3ccc4ccccc4c3)CC2)nc1=O