Reaction Details
TargetCalcitonin gene-related peptide type 1 receptor/Receptor activity-modifying protein 1
LigandBDBM50184074
Substrate/Competitorn/a
Meas. Tech.ChEMBL_353838 (CHEMBL866916)
Ki 83±n/a nM
Citation Williams, TMStump, CANguyen, DNQuigley, AGBell, IMGallicchio, SNZartman, CBWan, BLPenna, KDKunapuli, PKane, SAKoblan, KSMosser, SDRutledge, RZSalvatore, CFay, JFVacca, JPGraham, SL Non-peptide calcitonin gene-related peptide receptor antagonists from a benzodiazepinone lead. Bioorg Med Chem Lett16:2595-8 (2006) 
 
Calcitonin gene-related peptide type 1 receptor/Receptor activity-modifying protein 1
Name:Calcitonin gene-related peptide type 1 receptor/Receptor activity-modifying protein 1
Synonyms:Calcitonin-gene-related peptide receptor, CALCRL/RAMP1
Type:n/a
Mol. Mass.:n/a
Description:ASSAY_ID of EBI is 327200
Components:This complex has 2 components.
Component 1
Name:Calcitonin gene-related peptide type 1 receptor
Type:Enzyme Catalytic Domain
Mol. Mass.:52980.45
Organism:Homo sapiens (Human)
Description:Q16602
Residue:461
Component 2
Name:Receptor activity-modifying protein 1
Synonyms:Calcitonin-gene-related peptide receptor, CALCRL/RAMP1 RAMP1_HUMAN
Type:PROTEIN
Mol. Mass.:16992.80
Organism:Homo sapiens (Human)
Description:EBI_100673
Residue:148
BDBM50184074
NameBDBM50184074
Synonyms:(R)-N-(3-(3,5-dibromo-4-hydroxyphenyl)-1-oxo-1-(4-phenylpiperazin-1-yl)propan-2-yl)-4-(2-oxo-2,3-dihydrobenzo[d]imidazol-1-yl)piperidine-1-carboxamide | CHEMBL381585
TypeSmall organic molecule
Emp. Form.C32H34Br2N6O4
Mol. Mass.726.458
SMILESOc1c(Br)cc(C[C@@H](NC(=O)N2CCC(CC2)n2c3ccccc3[nH]c2=O)C(=O)N2CCN(CC2)c2ccccc2)cc1Br