Reaction Details
TargetB1 bradykinin receptor
LigandBDBM50184178
Substrate/Competitorn/a
Meas. Tech.ChEMBL_350972 (CHEMBL858907)
Ki 5.2±n/a nM
Citation Kuduk, SDDi Marco, CNChang, RKWood, MRKim, JJSchirripa, KMMurphy, KLRansom, RWTang, CTorrent, MHa, SPrueksaritanont, TPettibone, DJBock, MG 5-Piperazinyl pyridine carboxamide bradykinin B1 antagonists. Bioorg Med Chem Lett16:2791-5 (2006) 
 
B1 bradykinin receptor
Name:B1 bradykinin receptor
Type:Enzyme
Mol. Mass.:40508.87
Organism:Homo sapiens (Human)
Description:P46663
Residue:353
BDBM50184178
NameBDBM50184178
Synonyms:3,3'-difluoro-4'-({5-[4-(2-fluoro-ethyl)-piperazine-1-carbonyl]-pyridin-2-ylamino}-methyl)-biphenyl-2-carboxylic acid methyl ester | CHEMBL382228
TypeSmall organic molecule
Emp. Form.C27H27F3N4O3
Mol. Mass.512.5235
SMILESCOC(=O)c1c(F)cccc1-c1ccc(CNc2ccc(cn2)C(=O)N2CCN(CCF)CC2)c(F)c1