Reaction Details
TargetB1 bradykinin receptor
LigandBDBM50184205
Substrate/Competitorn/a
Meas. Tech.ChEMBL_350972 (CHEMBL858907)
Ki 3.3±n/a nM
Citation Kuduk, SDDi Marco, CNChang, RKWood, MRKim, JJSchirripa, KMMurphy, KLRansom, RWTang, CTorrent, MHa, SPrueksaritanont, TPettibone, DJBock, MG 5-Piperazinyl pyridine carboxamide bradykinin B1 antagonists. Bioorg Med Chem Lett16:2791-5 (2006) 
 
B1 bradykinin receptor
Name:B1 bradykinin receptor
Type:Enzyme
Mol. Mass.:40508.87
Organism:Homo sapiens (Human)
Description:P46663
Residue:353
BDBM50184205
NameBDBM50184205
Synonyms:4'-{[5-((E)-4-but-2-enyl)-piperazine-1-carbonyl]-pyridin-2-ylamino}-methyl)-3,3'-difluoro-biphenyl-2-carboxylic acid methyl ester | CHEMBL207800
TypeSmall organic molecule
Emp. Form.C29H30F2N4O3
Mol. Mass.520.5703
SMILESCOC(=O)c1c(F)cccc1-c1ccc(CNc2ccc(cn2)C(=O)N2CCN(C\C=C\C)CC2)c(F)c1