Reaction Details
TargetThromboxane A2 receptor
LigandBDBM50184214
Substrate/Competitorn/a
Meas. Tech.ChEMBL_364758 (CHEMBL871220)
Ki 260±n/a nM
Citation Sturino, CFLachance, NBoyd, MBerthelette, CLabelle, MLi, LRoy, BScheigetz, JTsou, NBrideau, CCauchon, ECarriere, MCDenis, DGreig, GKargman, SLamontagne, SMathieu, MCSawyer, NSlipetz, DO'Neill, GWang, ZZamboni, RMetters, KMYoung, RN Identification of an indole series of prostaglandin D2 receptor antagonists. Bioorg Med Chem Lett16:3043-8 (2006) 
 
Thromboxane A2 receptor
Name:Thromboxane A2 receptor
Type:Enyzme
Mol. Mass.:37445.28
Organism:Homo sapiens (Human)
Description:P21731
Residue:343
BDBM50184214
NameBDBM50184214
Synonyms:2-(4-(3-(trifluoromethoxy)benzyl)-5-bromo-7-(methylsulfonyl)-1,2,3,4-tetrahydrocyclopenta[b]indol-3-yl)acetic acid | CHEMBL209033
TypeSmall organic molecule
Emp. Form.C22H19BrF3NO5S
Mol. Mass.546.354
SMILESCS(=O)(=O)c1cc(Br)c2n(Cc3cccc(OC(F)(F)F)c3)c3C(CC(O)=O)CCc3c2c1