Reaction Details
TargetThromboxane A2 receptor
LigandBDBM50184226
Substrate/Competitorn/a
Meas. Tech.ChEMBL_364758 (CHEMBL871220)
Ki 1800±n/a nM
Citation Sturino, CFLachance, NBoyd, MBerthelette, CLabelle, MLi, LRoy, BScheigetz, JTsou, NBrideau, CCauchon, ECarriere, MCDenis, DGreig, GKargman, SLamontagne, SMathieu, MCSawyer, NSlipetz, DO'Neill, GWang, ZZamboni, RMetters, KMYoung, RN Identification of an indole series of prostaglandin D2 receptor antagonists. Bioorg Med Chem Lett16:3043-8 (2006) 
 
Thromboxane A2 receptor
Name:Thromboxane A2 receptor
Type:Enyzme
Mol. Mass.:37445.28
Organism:Homo sapiens (Human)
Description:P21731
Residue:343
BDBM50184226
NameBDBM50184226
Synonyms:2-(9-(4-chlorobenzyl)-8-(isopropylsulfinyl)-2,3,4,9-tetrahydro-1H-carbazol-1-yl)acetic acid | CHEMBL378628
TypeSmall organic molecule
Emp. Form.C24H26ClNO3S
Mol. Mass.443.986
SMILESCC(C)S(=O)c1cccc2c3CCCC(CC(O)=O)c3n(Cc3ccc(Cl)cc3)c12