Reaction Details
TargetProtein kinase C alpha type
LigandBDBM50184387
Substrate/Competitorn/a
Meas. Tech.ChEMBL_338717 (CHEMBL860607)
Ki 2100±n/a nM
Citation Lee, JKang, JHHan, KCKim, YKim, SYYoun, HSMook-Jung, IKim, HLo Han, JHHa, HJKim, YHMarquez, VELewin, NEPearce, LVLundberg, DJBlumberg, PM Branched diacylglycerol-lactones as potent protein kinase C ligands and alpha-secretase activators. J Med Chem49:2028-36 (2006) 
 
Protein kinase C alpha type
Name:Protein kinase C alpha type
Type:Enzyme
Mol. Mass.:76755.65
Organism:Homo sapiens (Human)
Description:The recombinant human PKC enzymes were produced using a baculovirus expression system in SF9 cells
Residue:672
BDBM50184387
NameBDBM50184387
Synonyms:5-(hydroxymethyl)-5-(pivaloyloxymethyl)-3,3-bis(3-methyl-2-butenyl)dihydro-2(3H)-furanone | CHEMBL206485
TypeSmall organic molecule
Emp. Form.C21H34O5
Mol. Mass.366.4917
SMILES[#6]\[#6](-[#6])=[#6]/[#6]C1([#6]\[#6]=[#6](\[#6])-[#6])[#6]C([#6]-[#8])([#6]-[#8]-[#6](=O)C([#6])([#6])[#6])[#8]-[#6]1=O