Reaction Details
TargetProtein kinase C alpha type
LigandBDBM50184382
Substrate/Competitorn/a
Meas. Tech.ChEMBL_338717 (CHEMBL860607)
Ki 6.2±n/a nM
Citation Lee, JKang, JHHan, KCKim, YKim, SYYoun, HSMook-Jung, IKim, HLo Han, JHHa, HJKim, YHMarquez, VELewin, NEPearce, LVLundberg, DJBlumberg, PM Branched diacylglycerol-lactones as potent protein kinase C ligands and alpha-secretase activators. J Med Chem49:2028-36 (2006) 
 
Protein kinase C alpha type
Name:Protein kinase C alpha type
Type:Enzyme
Mol. Mass.:76755.65
Organism:Homo sapiens (Human)
Description:The recombinant human PKC enzymes were produced using a baculovirus expression system in SF9 cells
Residue:672
BDBM50184382
NameBDBM50184382
Synonyms:5-hexanoyloxymethyl-5-hydroxymethyl-3-[(E)-3-isobutyl-5-methylhexylidene]tetrahydro-2-furanone | CHEMBL203521
TypeSmall organic molecule
Emp. Form.C23H40O5
Mol. Mass.396.5607
SMILESCCCCCC(=O)OCC1(CO)C\C(=C/CC(CC(C)C)CC(C)C)C(=O)O1