Reaction Details
TargetC-C chemokine receptor type 5
LigandBDBM50184402
Substrate/Competitorn/a
Meas. Tech.ChEMBL_338784 (CHEMBL860618)
IC50 2.2±n/a nM
Citation Seto, MAikawa, KMiyamoto, NAramaki, YKanzaki, NTakashima, KKuze, YIizawa, YBaba, MShiraishi, M Highly potent and orally active CCR5 antagonists as anti-HIV-1 agents: synthesis and biological activities of 1-benzazocine derivatives containing a sulfoxide moiety. J Med Chem49:2037-48 (2006) 
 
C-C chemokine receptor type 5
Name:C-C chemokine receptor type 5
Type:Enzyme
Mol. Mass.:40540.21
Organism:Homo sapiens (Human)
Description:P51681
Residue:352
BDBM50184402
NameBDBM50184402
Synonyms:(S)-(-)-8-{4-[2-(butoxy)ethoxy]phenyl}-1-propyl-N-(4-{[(4-propyl-4H-1,2,4-tri azol-3-yl)methyl]sulfinyl}phenyl)-1,2,3,4-tetrahydro-1-benzazocine-5-carboxamide | CHEMBL202814
TypeSmall organic molecule
Emp. Form.C39H49N5O4S
Mol. Mass.683.902
SMILESCCCCOCCOc1ccc(cc1)-c1ccc2N(CCC)CCCC(=Cc2c1)C(=O)Nc1ccc(cc1)S(=O)Cc1nncn1CCC