Reaction Details
TargetC-C chemokine receptor type 5
LigandBDBM50184403
Substrate/Competitorn/a
Meas. Tech.ChEMBL_338786 (CHEMBL859209)
IC50 5.3±n/a nM
Citation Seto, MAikawa, KMiyamoto, NAramaki, YKanzaki, NTakashima, KKuze, YIizawa, YBaba, MShiraishi, M Highly potent and orally active CCR5 antagonists as anti-HIV-1 agents: synthesis and biological activities of 1-benzazocine derivatives containing a sulfoxide moiety. J Med Chem49:2037-48 (2006) 
 
C-C chemokine receptor type 5
Name:C-C chemokine receptor type 5
Type:Enzyme
Mol. Mass.:40540.21
Organism:Homo sapiens (Human)
Description:P51681
Residue:352
BDBM50184403
NameBDBM50184403
Synonyms:7-(4-(2-butoxyethoxy)phenyl)-1-isobutyl-N-(4-((1-propyl-1H-imidazol-5-yl)methylsulfinyl)phenyl)-2,3-dihydro-1H-benzo[b]azepine-4-carboxamide | CHEMBL204821
TypeSmall organic molecule
Emp. Form.C40H50N4O4S
Mol. Mass.682.914
SMILESCCCCOCCOc1ccc(cc1)-c1ccc2N(CC(C)C)CCC(=Cc2c1)C(=O)Nc1ccc(cc1)S(=O)Cc1cncn1CCC