Reaction Details
TargetC-C chemokine receptor type 2
LigandBDBM50422828
Substrate/Competitorn/a
Meas. Tech.ChEMBL_338816 (CHEMBL860548)
IC50 5.9±n/a nM
Citation Seto, MAikawa, KMiyamoto, NAramaki, YKanzaki, NTakashima, KKuze, YIizawa, YBaba, MShiraishi, M Highly potent and orally active CCR5 antagonists as anti-HIV-1 agents: synthesis and biological activities of 1-benzazocine derivatives containing a sulfoxide moiety. J Med Chem49:2037-48 (2006) 
 
C-C chemokine receptor type 2
Name:C-C chemokine receptor type 2
Type:Enzyme
Mol. Mass.:41932.32
Organism:Homo sapiens (Human)
Description:P41597
Residue:374
BDBM50422828
NameBDBM50422828
Synonyms:CENICRIVIROC TAK-652 | TBR-652
TypeSmall organic molecule
Emp. Form.C41H52N4O4S
Mol. Mass.696.941
SMILESCCCCOCCOc1ccc(cc1)-c1ccc2N(CC(C)C)CCCC(=Cc2c1)C(=O)Nc1ccc(cc1)[S@@](=O)Cc1cncn1CCC