Reaction Details
TargetDNA polymerase beta
LigandBDBM50184751
Substrate/Competitorn/a
Meas. Tech.ChEMBL_356788 (CHEMBL861141)
IC50 22000±n/a nM
Citation Doncaster, JREtchells, LLKershaw, NMNakamura, RRyan, HTakeuchi, RSakaguchi, KSardarian, AWhitehead, RC Synthetic analogues of the manzamenones and plakoridines which inhibit DNA polymerase. Bioorg Med Chem Lett16:2877-81 (2006) 
 
DNA polymerase beta
Name:DNA polymerase beta
Type:Protein
Mol. Mass.:38188.76
Organism:Homo sapiens (Human)
Description:n/a
Residue:335
BDBM50184751
NameBDBM50184751
Synonyms:(2S,3S,4R)-methyl 2-ethyl-4-hydroxy-5-(2-oxotetradecylidene)-1-phenethylpyrrolidine-3-carboxylate | CHEMBL377599
TypeSmall organic molecule
Emp. Form.C30H47NO4
Mol. Mass.485.6985
SMILESCCCCCCCCCCCCC(=O)C=C1[C@H](O)[C@H]([C@H](CC)N1CCc1ccccc1)C(=O)OC